试用视觉搜索
使用图片进行搜索,而不限于文本
你提供的照片可能用于改善必应图片处理服务。
隐私政策
|
使用条款
在此处拖动一张或多张图像或
浏览
在此处放置图像
或
粘贴图像或 URL
拍照
单击示例图片试一试
了解更多
要使用可视化搜索,请在浏览器中启用相机
English
全部
图片
灵感
创建
集合
视频
地图
资讯
购物
更多
航班
旅游
酒店
搜索
笔记本
自动播放所有 GIF
在这里更改自动播放及其他图像设置
自动播放所有 GIF
拨动开关以打开
自动播放 GIF
图片尺寸
全部
小
中
大
特大
至少... *
自定义宽度
x
自定义高度
像素
请为宽度和高度输入一个数字
颜色
全部
仅限颜色
黑白
类型
全部
照片
剪贴画
素描
动画 GIF
透明
版式
全部
方形
横版
竖版
人物
全部
仅脸部
半身像
日期
全部
过去 24 小时
过去一周
过去一个月
去年
授权
全部
所有创作共用
公共领域
免费分享和使用
在商业上免费分享和使用
免费修改、分享和使用
在商业上免费修改、分享和使用
详细了解
清除筛选条件
安全搜索:
中等
严格
中等(默认)
关闭
筛选器
1200×628
blog.yue.coffee
Docker compose与gcc内存不足的错误 | 浅色圆锥曲线爱好者
1237×857
bbs.aw-ol.com
gcc: error: unrecognized command line option '-mfloat-abi=soft' 编译 …
320×180
clip.africa.com
Fix Gcc Error No Such File Or Directory In Vscode Gcc Erro…
1580×1031
stackoverflow.com
visual studio code - VSCode C running error, message error output with gcc …
1600×900
forums.macrumors.com
gcc compilation error -- ld: Undefined symbols | MacRumors Forums
300×65
ihaveapc.com
Quickly Fix GCC Fatal Error In Linux Mint/Ubuntu - I Have A PC | I Have A PC
819×560
blog.mhdsyarif.com
Solved : Unable to execute ‘gcc’: No such file or directory error: command ‘gcc’ fai…
600×1024
community.platformio.org
*error: sh1: avr-gcc no such fil…
768×379
positioniseverything.net
Error: Command 'gcc' Failed With Exit Status 1 (Fixed)
689×565
researchgate.net
GCC average (GCC av.) thickness within three gr…
1583×645
learn.microsoft.com
Teams Meeting Joining GCC Meeting Error - Microsoft Q&A
608×349
notsyncing.net
GCC is Scary - notsyncing.net
1131×655
NXP Semiconductors
Error Parser Issue (Freescale GCC Error Parser) - NXP Community
1920×1048
community.nxp.com
gcc error---Pfe_demo - NXP Community
1366×768
Stack Overflow
python - error: command 'gcc' failed with exit status 1 on centos 6.5 - Stack Overflow
1317×563
stackoverflow.com
c++ - Opencl/Gcc error vsc "fatal error: CL/cl.hpp: No such file or directory" - Stack …
1775×606
Stack Overflow
New to C: Compiling in Visual Studio Code... error: gcc not recognized? - Stack Overflow
748×667
discourse.odriverobotics.com
Arm-none-eabi-gcc: error: CreateProcess: …
844×504
discourse.odriverobotics.com
Arm-none-eabi-gcc: error: CreateProcess: No such file or direct…
845×865
stackoverflow.com
debugging - gcc.exe Invalid Argument Fatal Error no input fil…
1000×622
cboard.cprogramming.com
HELP! gcc multiple errors related to libraries
2164×1674
github.io
TWpower's Tech Blog
960×540
nelkinda.com
Suppressing Warnings in GCC and Clang
1460×690
interrupt.memfault.com
The Best and Worst GCC Compiler Flags For Embedded | Interrupt
660×325
pocketmagic.net
Android NDK Cygwin make error 127 – PocketMagic
1035×439
cnblogs.com
windows gcc 遇到的问题解决 - lonecloud - 博客园
983×720
laitimes.com
gcc: error trying to exec ‘cc1plus‘: execvp: No such file or directory - …
1338×172
wch.cn
CH573 编译报错riscv-none-embed-gcc: error: missing argument to '-l' - 沁恒微电子社区
1854×478
wch.cn
CH573 编译报错riscv-none-embed-gcc: error: missing argument to '-l' - 沁恒微电子社区
1469×923
wch.cn
CH573 编译报错riscv-none-embed-gcc: error: missing argument to '-l' - 沁恒微电子社区
840×274
CSDN
gcc: error: unrecognized argument in option ‘-mabi=aapcs-linux’-CSDN博客
1230×263
blog.csdn.net
compilation terminated.-CSDN博客
1528×651
coding.imooc.com
scrapy报错:error: command 'x86_64-linux-gnu-gcc' failed with exit status 1-慕课网
736×458
blog.51cto.com
Ubuntu18.04——切换gcc版本 / 报错解决: error -- unsupported GNU version gcc later …
581×311
blog.csdn.net
gcc: error trying to exec ‘cc1plus‘: execvp: No such file or directory报错问题解决_error trying to ...
某些结果已被隐藏,因为你可能无法访问这些结果。
显示无法访问的结果
报告不当内容
请选择下列任一选项。
无关
低俗内容
成人
儿童性侵犯
反馈